{"text_format":"1","workbook":"xlsx","n_sheets":5,"sheets":["Data","Register_deltag_organisationer","Deltagarförteckning","Intyg för närvarotid","Instruktion"],"not_rendered":{"charts":0,"images":1,"macros":1,"external_links":0,"defined_names":8,"comments":1,"pivot_tables":0},"unopened":[],"bounds":{"document_bytes":16777216,"sheet_cells":100000,"rows_first":2000,"rows_last":500,"rows_between":2000,"halvings":0,"cell_chars":16384,"cell_head_chars":4096},"cells_cut":0,"cells_raw":0,"read":"whole","date_system":"1900"}

{"sheet":"Data","index":0,"n_rows":21,"n_cols":11,"rows_kept":21,"cut":false,"hidden":true,"merged":[]}
["-",null,"Programområde",null,null,"-",null,"-","Privat aktör",{"$f":"SUMIF(Register_deltag_organisationer!C:C,Data!I1,Register_deltag_organisationer!D:D)","v":0}]
["Arbetsförmedlingen","Ja",1,null,null,"Januari",null,2015,"Kommun",{"$f":"SUMIF(Register_deltag_organisationer!C:C,Data!I2,Register_deltag_organisationer!D:D)","v":0}]
["Försäkringskassan","Nej",2,null,null,"Februari",null,2016,"Landstingskommunal",{"$f":"SUMIF(Register_deltag_organisationer!C:C,Data!I3,Register_deltag_organisationer!D:D)","v":0}]
["Kommun",null,null,null,null,"Mars",null,2017,"Annan statlig aktör",{"$f":"SUMIF(Register_deltag_organisationer!C:C,Data!I4,Register_deltag_organisationer!D:D)","v":0}]
["Annan",null,null,null,null,"April",null,2018,"Övrig offentlig icke statlig aktör",{"$f":"SUMIF(Register_deltag_organisationer!C:C,Data!I5,Register_deltag_organisationer!D:D)","v":0}]
[null,null,null,null,null,"Maj",null,2019,"Arbetsförmedlingen",{"$f":"SUMIF(Register_deltag_organisationer!C:C,Data!I6,Register_deltag_organisationer!D:D)","v":0}]
[null,null,null,null,null,"Juni",null,2020,"Försäkringskassan",{"$f":"SUMIF(Register_deltag_organisationer!C:C,Data!I7,Register_deltag_organisationer!D:D)","v":0}]
[null,null,null,null,null,"Juli",null,2021,"Totalt",{"$f":"SUM(J1:J7)","v":0}]
[null,null,null,null,null,"Augusti",null,2022,"Enligt mall",{"$f":"Deltagarförteckning!H41","v":0}]
[null,null,null,null,null,"September",null,2023,"Stämmer",{"$f":"J8-J9","v":0},"Denna cell ska kontrolleras"]
[null,null,null,null,null,"Oktober"]
[null,null,null,null,null,"November"]
[null,null,null,null,null,"December"]
[]
[{"$f":"IF(SUM(#REF!)>0,\"1\",\"\")","v":{"$error":"#REF!"}}]
[]
[null,null,null,null,null,"Sista rad",40]
[]
[null,null,null,"dag",15]
[null,null,null,"månad",{"$f":"MONTH(DATEVALUE(Deltagarförteckning!H3&\"1\"))","v":{"$error":"#VALUE!"}}]
[null,null,null,"datum",{"$f":"DATE(Deltagarförteckning!H4,Data!E20,Data!E19)","v":{"$error":"#VALUE!"}}]

{"sheet":"Register_deltag_organisationer","index":1,"n_rows":526,"n_cols":4,"rows_kept":526,"cut":false,"hidden":false,"merged":[[2,0,2,2]]}
["Diarienummer",{"$f":"Deltagarförteckning!B3","v":0}]
["Projektnamn",{"$f":"Deltagarförteckning!B4","v":0}]
["Register över organisationer som kompetensutvecklar sin personal genom socialfondsprojekt, inom programområde 1 (PO1) - Kompetensförsörjning. \nTiden i aktiviteter/kompetensutveckling räknas som medfinansiering i projektet."]
["Organisationsnamn","Organisationsnummer","Typ av organisation","Antal timmar"]
[]
[null,null,null,{"$f":"SUMIF(Deltagarförteckning!F:F,Register_deltag_organisationer!A6,Deltagarförteckning!H:H)","v":0}]
[null,null,null,{"$f":"SUMIF(Deltagarförteckning!F:F,Register_deltag_organisationer!A7,Deltagarförteckning!H:H)","v":0}]
[null,null,null,{"$f":"SUMIF(Deltagarförteckning!F:F,Register_deltag_organisationer!A8,Deltagarförteckning!H:H)","v":0}]
[null,null,null,{"$f":"SUMIF(Deltagarförteckning!F:F,Register_deltag_organisationer!A9,Deltagarförteckning!H:H)","v":0}]
[null,null,null,{"$f":"SUMIF(Deltagarförteckning!F:F,Register_deltag_organisationer!A10,Deltagarförteckning!H:H)","v":0}]
[null,null,null,{"$f":"SUMIF(Deltagarförteckning!F:F,Register_deltag_organisationer!A11,Deltagarförteckning!H:H)","v":0}]
[null,null,null,{"$f":"SUMIF(Deltagarförteckning!F:F,Register_deltag_organisationer!A12,Deltagarförteckning!H:H)","v":0}]
[null,null,null,{"$f":"SUMIF(Deltagarförteckning!F:F,Register_deltag_organisationer!A13,Deltagarförteckning!H:H)","v":0}]
[null,null,null,{"$f":"SUMIF(Deltagarförteckning!F:F,Register_deltag_organisationer!A14,Deltagarförteckning!H:H)","v":0}]
[null,null,null,{"$f":"SUMIF(Deltagarförteckning!F:F,Register_deltag_organisationer!A15,Deltagarförteckning!H:H)","v":0}]
[null,null,null,{"$f":"SUMIF(Deltagarförteckning!F:F,Register_deltag_organisationer!A16,Deltagarförteckning!H:H)","v":0}]
[null,null,null,{"$f":"SUMIF(Deltagarförteckning!F:F,Register_deltag_organisationer!A17,Deltagarförteckning!H:H)","v":0}]
[null,null,null,{"$f":"SUMIF(Deltagarförteckning!F:F,Register_deltag_organisationer!A18,Deltagarförteckning!H:H)","v":0}]
[null,null,null,{"$f":"SUMIF(Deltagarförteckning!F:F,Register_deltag_organisationer!A19,Deltagarförteckning!H:H)","v":0}]
[null,null,null,{"$f":"SUMIF(Deltagarförteckning!F:F,Register_deltag_organisationer!A20,Deltagarförteckning!H:H)","v":0}]
[null,null,null,{"$f":"SUMIF(Deltagarförteckning!F:F,Register_deltag_organisationer!A21,Deltagarförteckning!H:H)","v":0}]
[null,null,null,{"$f":"SUMIF(Deltagarförteckning!F:F,Register_deltag_organisationer!A22,Deltagarförteckning!H:H)","v":0}]
[null,null,null,{"$f":"SUMIF(Deltagarförteckning!F:F,Register_deltag_organisationer!A23,Deltagarförteckning!H:H)","v":0}]
[null,null,null,{"$f":"SUMIF(Deltagarförteckning!F:F,Register_deltag_organisationer!A24,Deltagarförteckning!H:H)","v":0}]
[null,null,null,{"$f":"SUMIF(Deltagarförteckning!F:F,Register_deltag_organisationer!A25,Deltagarförteckning!H:H)","v":0}]
[null,null,null,{"$f":"SUMIF(Deltagarförteckning!F:F,Register_deltag_organisationer!A26,Deltagarförteckning!H:H)","v":0}]
[null,null,null,{"$f":"SUMIF(Deltagarförteckning!F:F,Register_deltag_organisationer!A27,Deltagarförteckning!H:H)","v":0}]
[null,null,null,{"$f":"SUMIF(Deltagarförteckning!F:F,Register_deltag_organisationer!A28,Deltagarförteckning!H:H)","v":0}]
[null,null,null,{"$f":"SUMIF(Deltagarförteckning!F:F,Register_deltag_organisationer!A29,Deltagarförteckning!H:H)","v":0}]
[null,null,null,{"$f":"SUMIF(Deltagarförteckning!F:F,Register_deltag_organisationer!A30,Deltagarförteckning!H:H)","v":0}]
{"$rows_left_out":497}
{"sheet":"Deltagarförteckning","index":2,"n_rows":42,"n_cols":22,"rows_kept":42,"cut":false,"hidden":false,"merged":[[0,0,0,7],[6,7,7,7],[6,0,7,0],[6,6,7,6],[2,1,2,5],[1,0,1,7],[6,22,7,22],[6,15,7,15],[5,13,5,15],[5,16,5,22],[6,13,7,13],[6,14,7,14],[6,17,7,17],[6,20,7,20],[6,21,7,21],[6,16,7,16],[6,18,7,18],[6,19,7,19],[3,18,4,18],[3,11,3,12],[6,8,7,8],[6,9,7,9],[5,1,5,2],[6,5,7,5],[3,1,3,5],[6,11,7,11],[5,11,5,12],[6,1,7,1],[6,3,7,3],[6,4,7,4],[6,2,7,2],[6,12,7,12],[3,17,4,17]]}
["Sammanställning av närvarotid för deltagare i socialfondsprojekt",null,null,null,null,null,null,null,null,null,null,"Deltagarredovisning Indikatorer - uppgifter kopieras till SCB-mallen"]
["Insatser inom programområde 1 (PO1) - Kompetensförsörjning"]
["Diarienummer",null,null,null,null,null,"Redovisningsmånad"]
["Projektnamn",null,null,null,null,null,"År",null,null,null,null,"Läs instruktion för kopiering",null,null,null,null,null,"Läs instruktion för avslutsorsak","Läs instruktion för kvalifikation"]
[]
[null,null,null,null,null,null,null,null,null,null,null,"Besvaras alltid",null,"Besvaras vid första rapporteringen för delt.",null,null,"Besvaras när deltagaren slutar i projektet"]
["Namn","Personnummer  ÅÅÅÅMMDD-NNNN","Ålder","Kön","Räkna antal kön närvaro","Organisationsnamn","Organisationsnummer                      NNNNNN-NNNN","Aktiviteter/kompetensutvecklings-timmar per deltagare och månad","Formler unika","Unika företag",null,"Deltagarens personnummer","Antal timmar under månaden","Startdatum      ","Deltagaren från målgruppen","Deltagaren anvisad från","Avsluts-datum  ","Avsluts-orsak","Har deltagaren erhållit någon formell kvalifikation, certifiering eller motsvarande genom sitt projektdeltagande","Deltagarens status vid avslut","Anställnings-villkor","Anställningens omfattning"]
[]
[null,null,{"$f":"IFERROR(DATEDIF(CONCATENATE(MID(B9,3,2),\"-\",MID(B9,5,2),\"-\",MID(B9,7,2)),(Data!$E$21),\"Y\"),\"\")","v":""},{"$f":"IF(ISEVEN(MID(B9,12,1)),\"K\",\"M\")","v":{"$error":"#VALUE!"}},{"$f":"IF(M9>0,D9,\"\")","v":""},null,{"$f":"IFERROR(VLOOKUP(F9,Register_deltag_organisationer!A$6:B$502,2,FALSE),\"-\")","v":"-"},null,{"$f":"IF(COUNTIF($F$9:$F9,F9)>1,0,1)","v":1},{"$f":"IF(F9>1,I9,\"\")","v":""},null,{"$f":"SUBSTITUTE(B9,\"-\",\"\")","v":""},{"$f":"SUM(H9)","v":0},null,{"$f":"IF(B9>1,1,\"\")","v":""}]
[null,null,{"$f":"IFERROR(DATEDIF(CONCATENATE(MID(B10,3,2),\"-\",MID(B10,5,2),\"-\",MID(B10,7,2)),(Data!$E$21),\"Y\"),\"\")","v":""},{"$f":"IF(ISEVEN(MID(B10,12,1)),\"K\",\"M\")","v":{"$error":"#VALUE!"}},"",null,{"$f":"IFERROR(VLOOKUP(F10,Register_deltag_organisationer!A$6:B$502,2,FALSE),\"-\")","v":"-"},null,{"$f":"IF(COUNTIF($F$9:$F10,F10)>1,0,1)","v":1},{"$f":"IF(F10>1,I10,\"\")","v":""},null,{"$f":"SUBSTITUTE(B10,\"-\",\"\")","v":""},{"$f":"SUM(H10)","v":0},null,{"$f":"IF(B10>1,1,\"\")","v":""}]
[null,null,{"$f":"IFERROR(DATEDIF(CONCATENATE(MID(B11,3,2),\"-\",MID(B11,5,2),\"-\",MID(B11,7,2)),(Data!$E$21),\"Y\"),\"\")","v":""},{"$error":"#VALUE!"},"",null,{"$f":"IFERROR(VLOOKUP(F11,Register_deltag_organisationer!A$6:B$502,2,FALSE),\"-\")","v":"-"},null,{"$f":"IF(COUNTIF($F$9:$F11,F11)>1,0,1)","v":1},"",null,"",{"$f":"SUM(H11)","v":0},null,""]
[null,null,{"$f":"IFERROR(DATEDIF(CONCATENATE(MID(B12,3,2),\"-\",MID(B12,5,2),\"-\",MID(B12,7,2)),(Data!$E$21),\"Y\"),\"\")","v":""},{"$error":"#VALUE!"},"",null,{"$f":"IFERROR(VLOOKUP(F12,Register_deltag_organisationer!A$6:B$502,2,FALSE),\"-\")","v":"-"},null,{"$f":"IF(COUNTIF($F$9:$F12,F12)>1,0,1)","v":1},"",null,"",0,null,""]
[null,null,{"$f":"IFERROR(DATEDIF(CONCATENATE(MID(B13,3,2),\"-\",MID(B13,5,2),\"-\",MID(B13,7,2)),(Data!$E$21),\"Y\"),\"\")","v":""},{"$error":"#VALUE!"},"",null,{"$f":"IFERROR(VLOOKUP(F13,Register_deltag_organisationer!A$6:B$502,2,FALSE),\"-\")","v":"-"},null,{"$f":"IF(COUNTIF($F$9:$F13,F13)>1,0,1)","v":1},"",null,"",0,null,""]
[null,null,{"$f":"IFERROR(DATEDIF(CONCATENATE(MID(B14,3,2),\"-\",MID(B14,5,2),\"-\",MID(B14,7,2)),(Data!$E$21),\"Y\"),\"\")","v":""},{"$error":"#VALUE!"},"",null,{"$f":"IFERROR(VLOOKUP(F14,Register_deltag_organisationer!A$6:B$502,2,FALSE),\"-\")","v":"-"},null,{"$f":"IF(COUNTIF($F$9:$F14,F14)>1,0,1)","v":1},"",null,"",0,null,""]
[null,null,{"$f":"IFERROR(DATEDIF(CONCATENATE(MID(B15,3,2),\"-\",MID(B15,5,2),\"-\",MID(B15,7,2)),(Data!$E$21),\"Y\"),\"\")","v":""},{"$error":"#VALUE!"},"",null,{"$f":"IFERROR(VLOOKUP(F15,Register_deltag_organisationer!A$6:B$502,2,FALSE),\"-\")","v":"-"},null,{"$f":"IF(COUNTIF($F$9:$F15,F15)>1,0,1)","v":1},"",null,"",0,null,""]
[null,null,{"$f":"IFERROR(DATEDIF(CONCATENATE(MID(B16,3,2),\"-\",MID(B16,5,2),\"-\",MID(B16,7,2)),(Data!$E$21),\"Y\"),\"\")","v":""},{"$error":"#VALUE!"},"",null,{"$f":"IFERROR(VLOOKUP(F16,Register_deltag_organisationer!A$6:B$502,2,FALSE),\"-\")","v":"-"},null,{"$f":"IF(COUNTIF($F$9:$F16,F16)>1,0,1)","v":1},"",null,"",0,null,""]
[null,null,{"$f":"IFERROR(DATEDIF(CONCATENATE(MID(B17,3,2),\"-\",MID(B17,5,2),\"-\",MID(B17,7,2)),(Data!$E$21),\"Y\"),\"\")","v":""},{"$error":"#VALUE!"},"",null,{"$f":"IFERROR(VLOOKUP(F17,Register_deltag_organisationer!A$6:B$502,2,FALSE),\"-\")","v":"-"},null,{"$f":"IF(COUNTIF($F$9:$F17,F17)>1,0,1)","v":1},"",null,"",0,null,""]
[null,null,{"$f":"IFERROR(DATEDIF(CONCATENATE(MID(B18,3,2),\"-\",MID(B18,5,2),\"-\",MID(B18,7,2)),(Data!$E$21),\"Y\"),\"\")","v":""},{"$error":"#VALUE!"},"",null,{"$f":"IFERROR(VLOOKUP(F18,Register_deltag_organisationer!A$6:B$502,2,FALSE),\"-\")","v":"-"},null,{"$f":"IF(COUNTIF($F$9:$F18,F18)>1,0,1)","v":1},"",null,"",0,null,""]
[null,null,{"$f":"IFERROR(DATEDIF(CONCATENATE(MID(B19,3,2),\"-\",MID(B19,5,2),\"-\",MID(B19,7,2)),(Data!$E$21),\"Y\"),\"\")","v":""},{"$error":"#VALUE!"},"",null,{"$f":"IFERROR(VLOOKUP(F19,Register_deltag_organisationer!A$6:B$502,2,FALSE),\"-\")","v":"-"},null,{"$f":"IF(COUNTIF($F$9:$F19,F19)>1,0,1)","v":1},"",null,"",0,null,""]
[null,null,{"$f":"IFERROR(DATEDIF(CONCATENATE(MID(B20,3,2),\"-\",MID(B20,5,2),\"-\",MID(B20,7,2)),(Data!$E$21),\"Y\"),\"\")","v":""},{"$error":"#VALUE!"},"",null,{"$f":"IFERROR(VLOOKUP(F20,Register_deltag_organisationer!A$6:B$502,2,FALSE),\"-\")","v":"-"},null,{"$f":"IF(COUNTIF($F$9:$F20,F20)>1,0,1)","v":1},"",null,"",0,null,""]
[null,null,{"$f":"IFERROR(DATEDIF(CONCATENATE(MID(B21,3,2),\"-\",MID(B21,5,2),\"-\",MID(B21,7,2)),(Data!$E$21),\"Y\"),\"\")","v":""},{"$error":"#VALUE!"},"",null,{"$f":"IFERROR(VLOOKUP(F21,Register_deltag_organisationer!A$6:B$502,2,FALSE),\"-\")","v":"-"},null,{"$f":"IF(COUNTIF($F$9:$F21,F21)>1,0,1)","v":1},"",null,"",0,null,""]
[null,null,{"$f":"IFERROR(DATEDIF(CONCATENATE(MID(B22,3,2),\"-\",MID(B22,5,2),\"-\",MID(B22,7,2)),(Data!$E$21),\"Y\"),\"\")","v":""},{"$error":"#VALUE!"},"",null,{"$f":"IFERROR(VLOOKUP(F22,Register_deltag_organisationer!A$6:B$502,2,FALSE),\"-\")","v":"-"},null,{"$f":"IF(COUNTIF($F$9:$F22,F22)>1,0,1)","v":1},"",null,"",0,null,""]
[null,null,{"$f":"IFERROR(DATEDIF(CONCATENATE(MID(B23,3,2),\"-\",MID(B23,5,2),\"-\",MID(B23,7,2)),(Data!$E$21),\"Y\"),\"\")","v":""},{"$error":"#VALUE!"},"",null,{"$f":"IFERROR(VLOOKUP(F23,Register_deltag_organisationer!A$6:B$502,2,FALSE),\"-\")","v":"-"},null,{"$f":"IF(COUNTIF($F$9:$F23,F23)>1,0,1)","v":1},"",null,"",0,null,""]
[null,null,{"$f":"IFERROR(DATEDIF(CONCATENATE(MID(B24,3,2),\"-\",MID(B24,5,2),\"-\",MID(B24,7,2)),(Data!$E$21),\"Y\"),\"\")","v":""},{"$error":"#VALUE!"},"",null,{"$f":"IFERROR(VLOOKUP(F24,Register_deltag_organisationer!A$6:B$502,2,FALSE),\"-\")","v":"-"},null,{"$f":"IF(COUNTIF($F$9:$F24,F24)>1,0,1)","v":1},"",null,"",0,null,""]
[null,null,{"$f":"IFERROR(DATEDIF(CONCATENATE(MID(B25,3,2),\"-\",MID(B25,5,2),\"-\",MID(B25,7,2)),(Data!$E$21),\"Y\"),\"\")","v":""},{"$error":"#VALUE!"},"",null,{"$f":"IFERROR(VLOOKUP(F25,Register_deltag_organisationer!A$6:B$502,2,FALSE),\"-\")","v":"-"},null,{"$f":"IF(COUNTIF($F$9:$F25,F25)>1,0,1)","v":1},"",null,"",0,null,""]
[null,null,{"$f":"IFERROR(DATEDIF(CONCATENATE(MID(B26,3,2),\"-\",MID(B26,5,2),\"-\",MID(B26,7,2)),(Data!$E$21),\"Y\"),\"\")","v":""},{"$error":"#VALUE!"},"",null,{"$f":"IFERROR(VLOOKUP(F26,Register_deltag_organisationer!A$6:B$502,2,FALSE),\"-\")","v":"-"},null,{"$f":"IF(COUNTIF($F$9:$F26,F26)>1,0,1)","v":1},"",null,"",0,null,""]
[null,null,{"$f":"IFERROR(DATEDIF(CONCATENATE(MID(B27,3,2),\"-\",MID(B27,5,2),\"-\",MID(B27,7,2)),(Data!$E$21),\"Y\"),\"\")","v":""},{"$error":"#VALUE!"},"",null,{"$f":"IFERROR(VLOOKUP(F27,Register_deltag_organisationer!A$6:B$502,2,FALSE),\"-\")","v":"-"},null,{"$f":"IF(COUNTIF($F$9:$F27,F27)>1,0,1)","v":1},"",null,"",0,null,""]
[null,null,{"$f":"IFERROR(DATEDIF(CONCATENATE(MID(B28,3,2),\"-\",MID(B28,5,2),\"-\",MID(B28,7,2)),(Data!$E$21),\"Y\"),\"\")","v":""},{"$error":"#VALUE!"},"",null,{"$f":"IFERROR(VLOOKUP(F28,Register_deltag_organisationer!A$6:B$502,2,FALSE),\"-\")","v":"-"},null,{"$f":"IF(COUNTIF($F$9:$F28,F28)>1,0,1)","v":1},"",null,"",0,null,""]
[null,null,{"$f":"IFERROR(DATEDIF(CONCATENATE(MID(B29,3,2),\"-\",MID(B29,5,2),\"-\",MID(B29,7,2)),(Data!$E$21),\"Y\"),\"\")","v":""},{"$error":"#VALUE!"},"",null,{"$f":"IFERROR(VLOOKUP(F29,Register_deltag_organisationer!A$6:B$502,2,FALSE),\"-\")","v":"-"},null,{"$f":"IF(COUNTIF($F$9:$F29,F29)>1,0,1)","v":1},"",null,"",0,null,""]
[null,null,{"$f":"IFERROR(DATEDIF(CONCATENATE(MID(B30,3,2),\"-\",MID(B30,5,2),\"-\",MID(B30,7,2)),(Data!$E$21),\"Y\"),\"\")","v":""},{"$error":"#VALUE!"},"",null,{"$f":"IFERROR(VLOOKUP(F30,Register_deltag_organisationer!A$6:B$502,2,FALSE),\"-\")","v":"-"},null,{"$f":"IF(COUNTIF($F$9:$F30,F30)>1,0,1)","v":1},"",null,"",0,null,""]
{"$rows_left_out":13}
{"sheet":"Intyg för närvarotid","index":3,"n_rows":42,"n_cols":4,"rows_kept":42,"cut":false,"hidden":false,"merged":[[31,0,31,1],[30,0,30,1],[28,0,28,1],[27,0,27,1],[26,0,26,1],[29,0,29,1],[25,0,25,1],[41,0,43,3],[33,0,33,3],[19,0,19,3],[13,0,13,1],[16,0,16,1],[37,0,37,1],[38,0,38,1],[18,0,18,1],[20,0,20,1],[36,2,36,3],[37,2,37,3],[17,0,17,1],[21,0,21,1],[22,0,22,1],[13,2,13,3],[12,2,12,3],[23,0,23,1],[0,0,1,4],[11,0,11,3],[2,0,2,4]]}
["Intyg för närvarotid för deltagare i socialfondsprojekt"]
[]
["Insatser inom programområde 1 (PO1) - Kompetensförsörjning"]
[]
[]
[]
[]
["Diarienummer",{"$f":"Deltagarförteckning!B3:E3","v":0},"Redovisningsmånad",{"$f":"Deltagarförteckning!H3","v":0}]
["Projektnamn",{"$f":"Deltagarförteckning!B4:E4","v":0},"År",{"$f":"Deltagarförteckning!H4","v":0}]
[]
[]
["Timmar som utgör grund för medfinansiering. Registreras i ansökan om utbetalning under medfinansiering i annat än pengar under posten Personal."]
["Timlönegrupp ","1"," Totalt antal närvarotimmar under månaden"]
["Medfinansiering, närvarotid i aktiviteter/kompetensutvecklingsinsatser",null,{"$f":"Deltagarförteckning!H41","v":0}]
[]
[]
["Totalt antal deltagare under månaden",null,{"$f":"COUNTIF(Deltagarförteckning!M9:M400,\">0\")","v":0}]
["Totalt antal deltagande organisationer under månaden",null,{"$f":"Deltagarförteckning!J41","v":0}]
["Totalt antal utbildningstimmar under månaden",null,{"$f":"SUM(Deltagarförteckning!H41)","v":0}]
[]
["Antal timmar i snitt per deltagare ",null,{"$f":"IFERROR(C19/C17,\"\")","v":""}]
["Antal timmar i snitt per organisation",null,{"$f":"IFERROR(C19/C18,\"\")","v":""}]
["Antal kvinnor",null,{"$f":"COUNTIF(Deltagarförteckning!E9:E500,\"=K\")","v":0}]
["Antal män",null,{"$f":"COUNTIF(Deltagarförteckning!E9:E500,\"=M\")","v":0}]
["Nedanstående timmar ska rapporteras i ansökan om utbetalning:"]
["Privat aktör ",null,{"$f":"IF(Data!J1=0,\"\",Data!J1)","v":""}]
["Kommun",null,{"$f":"IF(Data!J2=0,\"\",Data!J2)","v":""}]
["Landstingskommunal",null,{"$f":"IF(Data!J3=0,\"\",Data!J3)","v":""}]
["Annan statlig aktör",null,{"$f":"IF(Data!J4=0,\"\",Data!J4)","v":""}]
["Övrig offentlig icke statlig aktör",null,{"$f":"IF(Data!J5=0,\"\",Data!J5)","v":""}]
{"$rows_left_out":13}
{"sheet":"Instruktion","index":4,"n_rows":16,"n_cols":1,"rows_kept":16,"cut":false,"hidden":false,"merged":[[14,0,14,13],[15,0,15,13],[5,0,5,13],[11,0,11,13],[12,0,12,13],[13,0,13,13],[6,0,6,13],[7,0,7,13],[8,0,8,13],[9,0,9,13],[10,0,10,13],[0,0,0,13],[1,0,1,13],[2,0,2,13],[3,0,3,13],[4,0,4,13]]}
["Instruktion"]
[" för sammanställning av närvarotid för deltagare i socialfondsprojekt \nInsatser inom programområde 1 (PO1) - Kompetensförsörjning"]
["Deltagarna i socialfondsprojekt ska redovisa sin närvarotid. Genom blanketten Närvarorapport för deltagare i socialfondsprojekt skapas underlag för att sammanställa uppgifter som Svenska ESF-rådet ska ha in som underlag vid ansökan om utbetalning.\nDessa uppgifter fungerar även som underlag för rapportering till Statistiska centralbyrån (SCB). SCB samlar in och sammanställer information om deltagare i socialfondsprojekt för rapportering till EU-kommissionen. För att underlätta rapporteringen fungerar den här blanketten både för rapporteringen till Svenska ESF-rådet samt till SCB. Dokumentet bygger på excel och består av fyra flikar: Register deltagande organisationer, Deltagarförteckning, Intyg för närvarotid och Instruktion."]
["Så här fyller ni i blanketten:\n"]
["Flik Register deltagande organisationer\n"]
["I registret fyller ni i de organisationer i projektet som kompetensutvecklar sin personal. Projektets diarienummer och namn anger du i fliken Deltagarförteckning. Registret underlättar ifyllandet av deltagarförteckningen eftersom uppgifterna där hämtas från registret."]
["Flik Deltagarförteckning"]
["Börja med att fylla i projektets diarienummer och namn. Uppgifterna förs automatiskt över till fliken Register deltagande organisationer. \nAnge aktuell månad samt år som rapporteringen avser. \nAnge deltagarnas namn och personnummer. Ålder räknas ut automatiskt och fungerar som informationsfält.\nUppgifter om organisationsnamn och organisationsnummer hämtas från registret deltagande organisationer genom att ni ställer er i rutan och väljer i rullisten. Se flik Register deltagande organisationer.\nAnge antal närvarotimmar för deltagaren enligt underlag för närvarorapport som deltagaren fyllt i och som godkänts av överordnad chef."]
["Flik Intyg för närvarotid"]
["En sammanställning över de uppgifter ni uppger i deltagarförteckningen förs automatiskt över till intyget för närvarotid. Intyget skrivs ut och undertecknas samt skickas in till Svenska ESF-rådet i samband med ansökan om utbetalning. Observera att deltagarförteckningen och närvarorapporterna för deltagarna ska sparas hos er i det fall Svenska ESF-rådet eller ett revisionsorgan behöver kontrollera inlämnade uppgifter. \nUppgifterna från fliken Intyg närvarotid är de som ni sedan överför till ansökan om utbetalning när ni redovisar i Projektrummet. "]
["Deltagarredovisning Indikatorer – uppgifter kopieras till SCB-mallen"]
["Uppgifter som redan är ifyllda i sammanställningen gällande deltagarens personnummer och antal närvarotimmar under månaden samt inom vilket programområde deltagaren är rapporterad förs automatiskt över till underlaget för SCB-rapporteringen. Uppgifter gällande start och avslut fyller ni i vid aktuell tidpunkt. \nUppgifterna speglar de uppgifter som ni måste rapportera till SCB. Följ instruktionen för kopiering som ni finner i överkant i dokumentet och kopiera till SCB-rapporteringen som ni har fått inloggningsuppgifter till."]
["Vid första rapporteringen"]
["Uppge datum då deltagaren skrivs in i projektet.\nRutan Deltagaren anvisad från gäller inte för rapportering inom programområde 1, bortse från den."]
["När deltagaren slutar i projektet"]
["Ställ er i respektive ruta i dokumentet så kommer en hjälpruta fram som stöd för vad som ska fyllas i. Uppge deltagarens e-postadress och telefonnummer. \nDet finns en kort instruktion i ovankant vad som avses med en formell kvalifikation och avslutsorsak, klicka på rutan Instruktion för kvalifikation eller instruktion för avslutsorsak för mer information.\n \n"]